Target
Botulinum neurotoxin type A
Ligand
BDBM72686
Substrate
Meas. Tech.
High-throughput multiplex microsphere dose response for inhibitors of toxin protease, specifically Botulinum neurotoxin light chain A protease, compounds from Cherry Pick 01
EC50
>20000±n/a nM
Citation
 PubChem, PC High-throughput multiplex microsphere dose response for inhibitors of toxin protease, specifically Botulinum neurotoxin light chain A protease, compounds from Cherry Pick 01 PubChem Bioassay (2012)[AID] 
Target
Name:
Botulinum neurotoxin type A
Synonyms:
BXA1_CLOBH bna | botA
Type:
PROTEIN
Mol. Mass.:
149421.96
Organism:
Clostridium botulinum (strain Hall / ATCC 3502 / NCTC 13319 / Type A)
Description:
ChEMBL_987932
Residue:
1296
  
Inhibitor
Name:
BDBM72686
Synonyms:
3-(1H-benzimidazol-2-ylamino)-1-isoindolone MLS000757049 cid_328013
Type:
Small organic molecule
Emp. Form.:
C15H10N4O
Mol. Mass.:
262.2661
SMILES:
O=C1N=C(Nc2nc3ccccc3[nH]2)c2ccccc12
: