Target
Tyrosine-protein kinase ABL1
Ligand
BDBM87384
Substrate
Meas. Tech.
TRFRET-based biochemical high throughput dose response assay for inhibitors of the interaction of the Ras and Rab interactor 1 protein (Rin1) and the c-abl oncogene 1
IC50
23760±n/a nM
Citation
 PubChem, PC TRFRET-based biochemical high throughput dose response assay for inhibitors of the interaction of the Ras and Rab interactor 1 protein (Rin1) and the c-abl oncogene 1, non-receptor tyrosine kinase (Abl) PubChem Bioassay (2012)[AID] 
Target
Name:
Tyrosine-protein kinase ABL1
Synonyms:
ABL ABL1_HUMAN JTK7 Proto-oncogene tyrosine-protein kinase ABL1 Tyrosine-protein kinase ABL V-abl Abelson murine leukemia viral oncogene homolog 1 p150 | tyrosine-protein kinase ABL1 isoform a
Type:
Enzyme
Mol. Mass.:
122897.30
Organism:
Homo sapiens (Human)
Description:
P00519
Residue:
1130
  
Inhibitor
Name:
BDBM87384
Synonyms:
(2,5-Dioxo-hexahydro-imidazo[4,5-d]imidazol-1-yl)-acetic acid ethyl ester 2-(2,5-dioxo-3,3a,6,6a-tetrahydro-1H-imidazo[4,5-d]imidazol-4-yl)acetic acid ethyl ester SMR000012274 ethyl 2-(2,5-dioxo-3,3a,6,6a-tetrahydro-1H-imidazo[4,5-d]imidazol-4-yl)acetate | ethyl 2-[2,5-bis(oxidanylidene)-3,3a,6,6a-tetrahydro-1H-imidazo[4,5-d]imidazol-4-yl]ethanoate
Type:
Small organic molecule
Emp. Form.:
C8H12N4O4
Mol. Mass.:
228.2053
SMILES:
CCOC(=O)CN1C2NC(=O)NC2NC1=O
: