Target
Tyrosine-protein kinase ABL1
Ligand
BDBM87391
Substrate
Meas. Tech.
TRFRET-based biochemical high throughput dose response assay for inhibitors of the interaction of the Ras and Rab interactor 1 protein (Rin1) and the c-abl oncogene 1
IC50
659.08±n/a nM
Citation
 PubChem, PC TRFRET-based biochemical high throughput dose response assay for inhibitors of the interaction of the Ras and Rab interactor 1 protein (Rin1) and the c-abl oncogene 1, non-receptor tyrosine kinase (Abl) PubChem Bioassay (2012)[AID] 
Target
Name:
Tyrosine-protein kinase ABL1
Synonyms:
ABL ABL1_HUMAN JTK7 Proto-oncogene tyrosine-protein kinase ABL1 Tyrosine-protein kinase ABL V-abl Abelson murine leukemia viral oncogene homolog 1 p150 | tyrosine-protein kinase ABL1 isoform a
Type:
Enzyme
Mol. Mass.:
122897.30
Organism:
Homo sapiens (Human)
Description:
P00519
Residue:
1130
  
Inhibitor
Name:
BDBM87391
Synonyms:
2-[(4-acetoxy-3-methoxy-benzoyl)amino]-5-hydroxy-benzoic acid 2-[(4-acetyloxy-3-methoxybenzoyl)amino]-5-hydroxybenzoic acid MLS000036604 cid_666497
Type:
Small organic molecule
Emp. Form.:
C17H15NO7
Mol. Mass.:
345.3035
SMILES:
COc1cc(ccc1OC(C)=O)C(=O)Nc1ccc(O)cc1C(O)=O
: