Target
Tyrosine-protein kinase ABL1
Ligand
BDBM87404
Substrate
Meas. Tech.
TRFRET-based biochemical high throughput dose response assay for inhibitors of the interaction of the Ras and Rab interactor 1 protein (Rin1) and the c-abl oncogene 1
IC50
548.02±n/a nM
Citation
 PubChem, PC TRFRET-based biochemical high throughput dose response assay for inhibitors of the interaction of the Ras and Rab interactor 1 protein (Rin1) and the c-abl oncogene 1, non-receptor tyrosine kinase (Abl) PubChem Bioassay (2012)[AID] 
Target
Name:
Tyrosine-protein kinase ABL1
Synonyms:
ABL ABL1_HUMAN JTK7 Proto-oncogene tyrosine-protein kinase ABL1 Tyrosine-protein kinase ABL V-abl Abelson murine leukemia viral oncogene homolog 1 p150 | tyrosine-protein kinase ABL1 isoform a
Type:
Enzyme
Mol. Mass.:
122897.30
Organism:
Homo sapiens (Human)
Description:
P00519
Residue:
1130
  
Inhibitor
Name:
BDBM87404
Synonyms:
6-[5-(4-morpholinylmethyl)-2-oxo-1,3-dihydroimidazol-4-yl]-6-oxohexanoic acid ethyl ester MLS000050816 cid_2217917 ethyl 6-[5-(morpholin-4-ylmethyl)-2-oxidanylidene-1,3-dihydroimidazol-4-yl]-6-oxidanylidene-hexanoate | ethyl 6-[5-(morpholin-4-ylmethyl)-2-oxo-1,3-dihydroimidazol-4-yl]-6-oxohexanoate
Type:
Small organic molecule
Emp. Form.:
C16H25N3O5
Mol. Mass.:
339.3868
SMILES:
CCOC(=O)CCCCC(=O)c1[nH]c(=O)[nH]c1CN1CCOCC1
: