Target
Tyrosine-protein kinase ABL1
Ligand
BDBM87415
Substrate
Meas. Tech.
TRFRET-based biochemical high throughput dose response assay for inhibitors of the interaction of the Ras and Rab interactor 1 protein (Rin1) and the c-abl oncogene 1
IC50
2621±n/a nM
Citation
 PubChem, PC TRFRET-based biochemical high throughput dose response assay for inhibitors of the interaction of the Ras and Rab interactor 1 protein (Rin1) and the c-abl oncogene 1, non-receptor tyrosine kinase (Abl) PubChem Bioassay (2012)[AID] 
Target
Name:
Tyrosine-protein kinase ABL1
Synonyms:
ABL ABL1_HUMAN JTK7 Proto-oncogene tyrosine-protein kinase ABL1 Tyrosine-protein kinase ABL V-abl Abelson murine leukemia viral oncogene homolog 1 p150 | tyrosine-protein kinase ABL1 isoform a
Type:
Enzyme
Mol. Mass.:
122897.30
Organism:
Homo sapiens (Human)
Description:
P00519
Residue:
1130
  
Inhibitor
Name:
BDBM87415
Synonyms:
7-(2,4-dichlorobenzyl)-8-imidazol-1-yl-1,3-dimethyl-xanthine 7-[(2,4-dichlorophenyl)methyl]-8-imidazol-1-yl-1,3-dimethyl-purine-2,6-dione MLS000112682 cid_1327046
Type:
Small organic molecule
Emp. Form.:
C17H14Cl2N6O2
Mol. Mass.:
405.238
SMILES:
Cn1c2nc(-n3ccnc3)n(Cc3ccc(Cl)cc3Cl)c2c(=O)n(C)c1=O
: