Target
Tyrosine-protein kinase ABL1
Ligand
BDBM87430
Substrate
Meas. Tech.
TRFRET-based biochemical high throughput dose response assay for inhibitors of the interaction of the Ras and Rab interactor 1 protein (Rin1) and the c-abl oncogene 1
IC50
>73445±n/a nM
Citation
 PubChem, PC TRFRET-based biochemical high throughput dose response assay for inhibitors of the interaction of the Ras and Rab interactor 1 protein (Rin1) and the c-abl oncogene 1, non-receptor tyrosine kinase (Abl) PubChem Bioassay (2012)[AID] 
Target
Name:
Tyrosine-protein kinase ABL1
Synonyms:
ABL ABL1_HUMAN JTK7 Proto-oncogene tyrosine-protein kinase ABL1 Tyrosine-protein kinase ABL V-abl Abelson murine leukemia viral oncogene homolog 1 p150 | tyrosine-protein kinase ABL1 isoform a
Type:
Enzyme
Mol. Mass.:
122897.30
Organism:
Homo sapiens (Human)
Description:
P00519
Residue:
1130
  
Inhibitor
Name:
BDBM87430
Synonyms:
2-[2-[(3,4-dimethoxyphenyl)methyl]-1-benzimidazolyl]-N-[(E)-(4-methoxyphenyl)methylideneamino]acetamide 2-[2-[(3,4-dimethoxyphenyl)methyl]benzimidazol-1-yl]-N-[(E)-(4-methoxyphenyl)methylideneamino]ethanamide N-[(E)-p-anisylideneamino]-2-(2-veratrylbenzimidazol-1-yl)acetamide cid_9635714
Type:
Small organic molecule
Emp. Form.:
C26H26N4O4
Mol. Mass.:
458.509
SMILES:
COc1ccc(\C=N\NC(=O)Cn2c(Cc3ccc(OC)c(OC)c3)nc3ccccc23)cc1
: