Target
Tyrosine-protein kinase ABL1
Ligand
BDBM87446
Substrate
Meas. Tech.
TRFRET-based biochemical high throughput dose response assay for inhibitors of the interaction of the Ras and Rab interactor 1 protein (Rin1) and the c-abl oncogene 1
IC50
15.03±n/a nM
Citation
 PubChem, PC TRFRET-based biochemical high throughput dose response assay for inhibitors of the interaction of the Ras and Rab interactor 1 protein (Rin1) and the c-abl oncogene 1, non-receptor tyrosine kinase (Abl) PubChem Bioassay (2012)[AID] 
Target
Name:
Tyrosine-protein kinase ABL1
Synonyms:
ABL ABL1_HUMAN JTK7 Proto-oncogene tyrosine-protein kinase ABL1 Tyrosine-protein kinase ABL V-abl Abelson murine leukemia viral oncogene homolog 1 p150 | tyrosine-protein kinase ABL1 isoform a
Type:
Enzyme
Mol. Mass.:
122897.30
Organism:
Homo sapiens (Human)
Description:
P00519
Residue:
1130
  
Inhibitor
Name:
BDBM87446
Synonyms:
MLS000719154 N-(3-chloro-4-fluoro-phenyl)-6-(2-keto-5-methyl-imidazolidin-4-yl)hexanamide N-(3-chloro-4-fluorophenyl)-6-(5-methyl-2-oxoimidazolidin-4-yl)hexanamide cid_4976766
Type:
Small organic molecule
Emp. Form.:
C16H21ClFN3O2
Mol. Mass.:
341.808
SMILES:
CC1NC(=O)NC1CCCCCC(=O)Nc1ccc(F)c(Cl)c1
: