Target
Tyrosine-protein kinase ABL1
Ligand
BDBM87453
Substrate
Meas. Tech.
TRFRET-based biochemical high throughput dose response assay for inhibitors of the interaction of the Ras and Rab interactor 1 protein (Rin1) and the c-abl oncogene 1
IC50
>73469±n/a nM
Citation
 PubChem, PC TRFRET-based biochemical high throughput dose response assay for inhibitors of the interaction of the Ras and Rab interactor 1 protein (Rin1) and the c-abl oncogene 1, non-receptor tyrosine kinase (Abl) PubChem Bioassay (2012)[AID] 
Target
Name:
Tyrosine-protein kinase ABL1
Synonyms:
ABL ABL1_HUMAN JTK7 Proto-oncogene tyrosine-protein kinase ABL1 Tyrosine-protein kinase ABL V-abl Abelson murine leukemia viral oncogene homolog 1 p150 | tyrosine-protein kinase ABL1 isoform a
Type:
Enzyme
Mol. Mass.:
122897.30
Organism:
Homo sapiens (Human)
Description:
P00519
Residue:
1130
  
Inhibitor
Name:
BDBM87453
Synonyms:
3-[(3-methyl-7,8-dihydro-6H-cyclopenta[4,5]thieno[1,2-c]pyrimidin-1-yl)amino]phenol SMR000370394 | cid_2537884
Type:
Small organic molecule
Emp. Form.:
C16H15N3OS
Mol. Mass.:
297.375
SMILES:
Cc1nc(Nc2cccc(O)c2)c2c3CCCc3sc2n1
: