Target
Tyrosine-protein kinase ABL1
Ligand
BDBM50711
Substrate
Meas. Tech.
TRFRET-based biochemical high throughput dose response assay for inhibitors of the interaction of the Ras and Rab interactor 1 protein (Rin1) and the c-abl oncogene 1
IC50
20687±n/a nM
Citation
 PubChem, PC TRFRET-based biochemical high throughput dose response assay for inhibitors of the interaction of the Ras and Rab interactor 1 protein (Rin1) and the c-abl oncogene 1, non-receptor tyrosine kinase (Abl) PubChem Bioassay (2012)[AID] 
Target
Name:
Tyrosine-protein kinase ABL1
Synonyms:
ABL ABL1_HUMAN JTK7 Proto-oncogene tyrosine-protein kinase ABL1 Tyrosine-protein kinase ABL V-abl Abelson murine leukemia viral oncogene homolog 1 p150 | tyrosine-protein kinase ABL1 isoform a
Type:
Enzyme
Mol. Mass.:
122897.30
Organism:
Homo sapiens (Human)
Description:
P00519
Residue:
1130
  
Inhibitor
Name:
BDBM50711
Synonyms:
2-(2-carbomethoxy-4-hydroxy-6-methoxy-phenoxy)-6-hydroxy-4-methyl-benzoic acid 2-hydroxy-6-(4-hydroxy-2-methoxy-6-methoxycarbonylphenoxy)-4-methylbenzoic acid MLS000863583 cid_3080568
Type:
Small organic molecule
Emp. Form.:
C17H16O8
Mol. Mass.:
348.3041
SMILES:
COC(=O)c1cc(O)cc(OC)c1Oc1cc(C)cc(O)c1C(O)=O
: