Target
Tyrosine-protein kinase ABL1
Ligand
BDBM87476
Substrate
Meas. Tech.
TRFRET-based biochemical high throughput dose response assay for inhibitors of the interaction of the Ras and Rab interactor 1 protein (Rin1) and the c-abl oncogene 1
IC50
50019±n/a nM
Citation
 PubChem, PC TRFRET-based biochemical high throughput dose response assay for inhibitors of the interaction of the Ras and Rab interactor 1 protein (Rin1) and the c-abl oncogene 1, non-receptor tyrosine kinase (Abl) PubChem Bioassay (2012)[AID] 
Target
Name:
Tyrosine-protein kinase ABL1
Synonyms:
ABL ABL1_HUMAN JTK7 Proto-oncogene tyrosine-protein kinase ABL1 Tyrosine-protein kinase ABL V-abl Abelson murine leukemia viral oncogene homolog 1 p150 | tyrosine-protein kinase ABL1 isoform a
Type:
Enzyme
Mol. Mass.:
122897.30
Organism:
Homo sapiens (Human)
Description:
P00519
Residue:
1130
  
Inhibitor
Name:
BDBM87476
Synonyms:
4-Amino-isothiazole-3,5-dicarboxylic acid 3-amide 5-[[benzylcarbamoyl-(4-hydroxy-phenyl)-methyl]-(2-methoxy-phenyl)-amide] 4-amino-N'-[2-(benzylamino)-1-(4-hydroxyphenyl)-2-keto-ethyl]-N'-(2-methoxyphenyl)isothiazole-3,5-dicarboxamide 4-azanyl-N5-[1-(4-hydroxyphenyl)-2-oxidanylidene-2-[(phenylmethyl)amino]ethyl]-N5-(2-methoxyphenyl)-1,2-thiazole-3,5-dicarboxamide SMR000599761 | cid_3177708
Type:
Small organic molecule
Emp. Form.:
C27H25N5O5S
Mol. Mass.:
531.583
SMILES:
COc1ccccc1N(C(C(=O)NCc1ccccc1)c1ccc(O)cc1)C(=O)c1snc(C(N)=O)c1N
: