Target
Tyrosine-protein kinase ABL1
Ligand
BDBM87496
Substrate
Meas. Tech.
TRFRET-based biochemical high throughput dose response assay for inhibitors of the interaction of the Ras and Rab interactor 1 protein (Rin1) and the c-abl oncogene 1
IC50
>73475±n/a nM
Citation
 PubChem, PC TRFRET-based biochemical high throughput dose response assay for inhibitors of the interaction of the Ras and Rab interactor 1 protein (Rin1) and the c-abl oncogene 1, non-receptor tyrosine kinase (Abl) PubChem Bioassay (2012)[AID] 
Target
Name:
Tyrosine-protein kinase ABL1
Synonyms:
ABL ABL1_HUMAN JTK7 Proto-oncogene tyrosine-protein kinase ABL1 Tyrosine-protein kinase ABL V-abl Abelson murine leukemia viral oncogene homolog 1 p150 | tyrosine-protein kinase ABL1 isoform a
Type:
Enzyme
Mol. Mass.:
122897.30
Organism:
Homo sapiens (Human)
Description:
P00519
Residue:
1130
  
Inhibitor
Name:
BDBM87496
Synonyms:
MLS002182960 N-(5-butyl-1,3,4-thiadiazol-2-yl)-4-[(3,5-dimethyl-4-isoxazolyl)methoxy]benzamide SMR001271990 | cid_25162705
Type:
Small organic molecule
Emp. Form.:
C19H22N4O3S
Mol. Mass.:
386.468
SMILES:
CCCCc1nnc(NC(=O)c2ccc(OCc3c(C)noc3C)cc2)s1
: