Target
Nuclear receptor coactivator 3
Ligand
BDBM52401
Substrate
Meas. Tech.
Counterscreen for inhibitors of the Steroid Receptor Coactivator 1 (SRC1; NCOA1)
IC50
>147.63±n/a nM
Citation
 PubChem, PC Counterscreen for inhibitors of the Steroid Receptor Coactivator 1 (SRC1; NCOA1): Luminescence-based cell-based high throughput dose response assay to identify inhibitors of the Steroid Receptor Coactivator 3 (SRC3; NCOA3) PubChem Bioassay (2012)[AID] 
Target
Name:
Nuclear receptor coactivator 3
Synonyms:
AIB1 NCOA3 RAC3 nuclear receptor coactivator 3 isoform a
Type:
Enzyme Catalytic Domain
Mol. Mass.:
155305.29
Organism:
Homo sapiens (Human)
Description:
Q9Y6Q9
Residue:
1424
  
Inhibitor
Name:
BDBM52401
Synonyms:
4-[(E)-2-(1,3-benzothiazol-2-yl)ethenyl]-N,N-dimethyl-aniline 4-[2-(1,3-benzothiazol-2-yl)vinyl]-N,N-dimethylaniline MLS000573782 [4-[(E)-2-(1,3-benzothiazol-2-yl)vinyl]phenyl]-dimethyl-amine | cid_5378081
Type:
Small organic molecule
Emp. Form.:
C17H16N2S
Mol. Mass.:
280.387
SMILES:
CN(C)c1ccc(\C=C\c2nc3ccccc3s2)cc1
: