Target
Nuclear receptor coactivator 3
Ligand
BDBM82712
Substrate
Meas. Tech.
Counterscreen for inhibitors of the Steroid Receptor Coactivator 1 (SRC1; NCOA1)
IC50
6251±n/a nM
Citation
 PubChem, PC Counterscreen for inhibitors of the Steroid Receptor Coactivator 1 (SRC1; NCOA1): Luminescence-based cell-based high throughput dose response assay to identify inhibitors of the Steroid Receptor Coactivator 3 (SRC3; NCOA3) PubChem Bioassay (2012)[AID] 
Target
Name:
Nuclear receptor coactivator 3
Synonyms:
AIB1 NCOA3 RAC3 nuclear receptor coactivator 3 isoform a
Type:
Enzyme Catalytic Domain
Mol. Mass.:
155305.29
Organism:
Homo sapiens (Human)
Description:
Q9Y6Q9
Residue:
1424
  
Inhibitor
Name:
BDBM82712
Synonyms:
2-[6-chloranyl-4-methyl-2-oxidanylidene-3-(2-oxidanylpropyl)chromen-7-yl]oxy-N-(3-ethanoylphenyl)ethanamide N-(3-Acetyl-phenyl)-2-[6-chloro-3-(2-hydroxy-propyl)-4-methyl-2-oxo-2H-chromen-7-yloxy]-acetamide N-(3-acetylphenyl)-2-[6-chloro-3-(2-hydroxypropyl)-4-methyl-2-oxochromen-7-yl]oxyacetamide SMR000218230 | cid_4639757
Type:
Small organic molecule
Emp. Form.:
C23H22ClNO6
Mol. Mass.:
443.877
SMILES:
CC(O)Cc1c(C)c2cc(Cl)c(OCC(=O)Nc3cccc(c3)C(C)=O)cc2oc1=O
: