Target
Nuclear receptor coactivator 3
Ligand
BDBM60521
Substrate
Meas. Tech.
Counterscreen for inhibitors of the Steroid Receptor Coactivator 1 (SRC1; NCOA1)
IC50
5368±n/a nM
Citation
 PubChem, PC Counterscreen for inhibitors of the Steroid Receptor Coactivator 1 (SRC1; NCOA1): Luminescence-based cell-based high throughput dose response assay to identify inhibitors of the Steroid Receptor Coactivator 3 (SRC3; NCOA3) PubChem Bioassay (2012)[AID] 
Target
Name:
Nuclear receptor coactivator 3
Synonyms:
AIB1 NCOA3 RAC3 nuclear receptor coactivator 3 isoform a
Type:
Enzyme Catalytic Domain
Mol. Mass.:
155305.29
Organism:
Homo sapiens (Human)
Description:
Q9Y6Q9
Residue:
1424
  
Inhibitor
Name:
BDBM60521
Synonyms:
(2E)-2-benzylidene-4-hydroxy-N'-[(E)-(2-hydroxy-4-oxocyclohexa-2,5-dien-1-ylidene)methyl]butanehydrazide (2E)-4-oxidanyl-N'-[(E)-(2-oxidanyl-4-oxidanylidene-cyclohexa-2,5-dien-1-ylidene)methyl]-2-(phenylmethylidene)butanehydrazide 4-Hydroxy-2-[1-phenyl-meth-(E)-ylidene]-butyric acid [1-(2,4-dihydroxy-phenyl)-meth-(E)-ylidene]-hydrazide SMR000211622 | cid_6518031
Type:
Small organic molecule
Emp. Form.:
C18H18N2O4
Mol. Mass.:
326.3465
SMILES:
OCCC(=Cc1ccccc1)C(=O)NN=Cc1ccc(O)cc1O
: