Target
Nuclear receptor coactivator 3
Ligand
BDBM53827
Substrate
Meas. Tech.
Counterscreen for inhibitors of the Steroid Receptor Coactivator 1 (SRC1; NCOA1)
IC50
>11958±n/a nM
Citation
 PubChem, PC Counterscreen for inhibitors of the Steroid Receptor Coactivator 1 (SRC1; NCOA1): Luminescence-based cell-based high throughput dose response assay to identify inhibitors of the Steroid Receptor Coactivator 3 (SRC3; NCOA3) PubChem Bioassay (2012)[AID] 
Target
Name:
Nuclear receptor coactivator 3
Synonyms:
AIB1 NCOA3 RAC3 nuclear receptor coactivator 3 isoform a
Type:
Enzyme Catalytic Domain
Mol. Mass.:
155305.29
Organism:
Homo sapiens (Human)
Description:
Q9Y6Q9
Residue:
1424
  
Inhibitor
Name:
BDBM53827
Synonyms:
MLS000587719 N'-[(E)-(3-bromanyl-6-oxidanylidene-cyclohexa-2,4-dien-1-ylidene)methyl]-2-morpholin-4-yl-2-pyridin-4-yl-ethanehydrazide N'-[(E)-(3-bromo-6-oxo-1-cyclohexa-2,4-dienylidene)methyl]-2-(4-morpholinyl)-2-pyridin-4-ylacetohydrazide SMR000211690 | cid_6138878
Type:
Small organic molecule
Emp. Form.:
C18H19BrN4O3
Mol. Mass.:
419.272
SMILES:
Oc1ccc(Br)cc1C=NNC(=O)C(N1CCOCC1)c1ccncc1
: