Target
Nuclear receptor coactivator 3
Ligand
BDBM63348
Substrate
Meas. Tech.
Counterscreen for inhibitors of the Steroid Receptor Coactivator 1 (SRC1; NCOA1)
IC50
12053±n/a nM
Citation
 PubChem, PC Counterscreen for inhibitors of the Steroid Receptor Coactivator 1 (SRC1; NCOA1): Luminescence-based cell-based high throughput dose response assay to identify inhibitors of the Steroid Receptor Coactivator 3 (SRC3; NCOA3) PubChem Bioassay (2012)[AID] 
Target
Name:
Nuclear receptor coactivator 3
Synonyms:
AIB1 NCOA3 RAC3 nuclear receptor coactivator 3 isoform a
Type:
Enzyme Catalytic Domain
Mol. Mass.:
155305.29
Organism:
Homo sapiens (Human)
Description:
Q9Y6Q9
Residue:
1424
  
Inhibitor
Name:
BDBM63348
Synonyms:
1-[4-(1-adamantyl)phenoxy]-3-[bis(2-hydroxyethyl)amino]-2-propanol hydrochloride 1-[4-(1-adamantyl)phenoxy]-3-[bis(2-hydroxyethyl)amino]propan-2-ol;hydrochloride SMR000271087 | cid_2921552
Type:
Small organic molecule
Emp. Form.:
C23H35NO4
Mol. Mass.:
389.5283
SMILES:
[H]C12CC3([H])CC([H])(C1)CC(C2)(C3)c1ccc(OCC(O)CN(CCO)CCO)cc1
: