Target
Nuclear receptor coactivator 1
Ligand
BDBM40958
Substrate
Meas. Tech.
Luminescence-based cell-based high throughput dose response assay for inhibitors of the Steroid Receptor Coactivator 1 (SRC1; NCOA1)
IC50
16902±n/a nM
Citation
 PubChem, PC Luminescence-based cell-based high throughput dose response assay for inhibitors of the Steroid Receptor Coactivator 1 (SRC1; NCOA1) PubChem Bioassay (2012)[AID] 
Target
Name:
Nuclear receptor coactivator 1
Synonyms:
BHLHE74 NCOA1 NCoA-1 Protein Hin-2 Renal carcinoma antigen NY-REN-52 SRC1 nuclear receptor coactivator 1 isoform 1
Type:
PROTEIN
Mol. Mass.:
156749.34
Organism:
Homo sapiens (Human)
Description:
ChEMBL_759690
Residue:
1441
  
Inhibitor
Name:
BDBM40958
Synonyms:
(6E)-6-[2-amino-5-(4-methoxyphenyl)-1H-pyrimidin-6-ylidene]-3-methoxy-1-cyclohexa-2,4-dienone (6E)-6-[2-amino-5-(4-methoxyphenyl)-1H-pyrimidin-6-ylidene]-3-methoxycyclohexa-2,4-dien-1-one MLS000083254 cid_5389961
Type:
Small organic molecule
Emp. Form.:
C18H17N3O3
Mol. Mass.:
323.3459
SMILES:
COc1ccc(cc1)-c1cnc(N)nc1-c1ccc(OC)cc1O
: