Target
Nuclear receptor coactivator 1
Ligand
BDBM44529
Substrate
Meas. Tech.
Luminescence-based cell-based high throughput dose response assay for inhibitors of the Steroid Receptor Coactivator 1 (SRC1; NCOA1)
IC50
>35873±n/a nM
Citation
 PubChem, PC Luminescence-based cell-based high throughput dose response assay for inhibitors of the Steroid Receptor Coactivator 1 (SRC1; NCOA1) PubChem Bioassay (2012)[AID] 
Target
Name:
Nuclear receptor coactivator 1
Synonyms:
BHLHE74 NCOA1 NCoA-1 Protein Hin-2 Renal carcinoma antigen NY-REN-52 SRC1 nuclear receptor coactivator 1 isoform 1
Type:
PROTEIN
Mol. Mass.:
156749.34
Organism:
Homo sapiens (Human)
Description:
ChEMBL_759690
Residue:
1441
  
Inhibitor
Name:
BDBM44529
Synonyms:
2-chloranyl-5-nitro-N-(5,6,7,8-tetrahydronaphthalen-1-yl)benzamide 2-chloro-5-nitro-N-(5,6,7,8-tetrahydronaphthalen-1-yl)benzamide MLS000573321 cid_881056
Type:
Small organic molecule
Emp. Form.:
C17H15ClN2O3
Mol. Mass.:
330.766
SMILES:
[O-][N+](=O)c1ccc(Cl)c(c1)C(=O)Nc1cccc2CCCCc12
: