Target
Nuclear receptor coactivator 1
Ligand
BDBM87269
Substrate
Meas. Tech.
Luminescence-based cell-based high throughput dose response assay for inhibitors of the Steroid Receptor Coactivator 1 (SRC1; NCOA1)
IC50
>35868±n/a nM
Citation
 PubChem, PC Luminescence-based cell-based high throughput dose response assay for inhibitors of the Steroid Receptor Coactivator 1 (SRC1; NCOA1) PubChem Bioassay (2012)[AID] 
Target
Name:
Nuclear receptor coactivator 1
Synonyms:
BHLHE74 NCOA1 NCoA-1 Protein Hin-2 Renal carcinoma antigen NY-REN-52 SRC1 nuclear receptor coactivator 1 isoform 1
Type:
PROTEIN
Mol. Mass.:
156749.34
Organism:
Homo sapiens (Human)
Description:
ChEMBL_759690
Residue:
1441
  
Inhibitor
Name:
BDBM87269
Synonyms:
4-chloranyl-N-[2,2,2-tris(chloranyl)-1-(morpholin-4-ylcarbothioylamino)ethyl]benzamide 4-chloro-N-[2,2,2-trichloro-1-[[4-morpholinyl(sulfanylidene)methyl]amino]ethyl]benzamide MLS000573497 cid_2898047
Type:
Small organic molecule
Emp. Form.:
C14H15Cl4N3O2S
Mol. Mass.:
431.165
SMILES:
Clc1ccc(cc1)C(=O)NC(NC(=S)N1CCOCC1)C(Cl)(Cl)Cl
: