Target
Nuclear receptor coactivator 1
Ligand
BDBM6774
Substrate
Meas. Tech.
Luminescence-based cell-based high throughput dose response assay for inhibitors of the Steroid Receptor Coactivator 1 (SRC1; NCOA1)
IC50
11819±n/a nM
Citation
 PubChem, PC Luminescence-based cell-based high throughput dose response assay for inhibitors of the Steroid Receptor Coactivator 1 (SRC1; NCOA1) PubChem Bioassay (2012)[AID] 
Target
Name:
Nuclear receptor coactivator 1
Synonyms:
BHLHE74 NCOA1 NCoA-1 Protein Hin-2 Renal carcinoma antigen NY-REN-52 SRC1 nuclear receptor coactivator 1 isoform 1
Type:
PROTEIN
Mol. Mass.:
156749.34
Organism:
Homo sapiens (Human)
Description:
ChEMBL_759690
Residue:
1441
  
Inhibitor
Name:
BDBM6774
Synonyms:
cid_9599854
Type:
Emp. Form.:
C23H27N3O7S2
Mol. Mass.:
521.606
SMILES:
CCCS(=O)(=O)c1c(C(=O)N\N=C\c2cc(O)cc(O)c2)n2cccc(C)c2c1S(=O)(=O)CCC
: