Target
Nuclear receptor coactivator 1
Ligand
BDBM79576
Substrate
Meas. Tech.
Luminescence-based cell-based high throughput dose response assay for inhibitors of the Steroid Receptor Coactivator 1 (SRC1; NCOA1)
IC50
11472±n/a nM
Citation
 PubChem, PC Luminescence-based cell-based high throughput dose response assay for inhibitors of the Steroid Receptor Coactivator 1 (SRC1; NCOA1) PubChem Bioassay (2012)[AID] 
Target
Name:
Nuclear receptor coactivator 1
Synonyms:
BHLHE74 NCOA1 NCoA-1 Protein Hin-2 Renal carcinoma antigen NY-REN-52 SRC1 nuclear receptor coactivator 1 isoform 1
Type:
PROTEIN
Mol. Mass.:
156749.34
Organism:
Homo sapiens (Human)
Description:
ChEMBL_759690
Residue:
1441
  
Inhibitor
Name:
BDBM79576
Synonyms:
4,6-Dimethoxy-1H-indole-2-carboxylic acid [1-(2-hydroxy-3-methoxy-phenyl)-meth-(E)-ylidene]-hydrazide 4,6-dimethoxy-N'-[(E)-(5-methoxy-6-oxo-1-cyclohexa-2,4-dienylidene)methyl]-1H-indole-2-carbohydrazide MLS000779102 SMR000415778 | cid_6224576
Type:
Small organic molecule
Emp. Form.:
C19H19N3O5
Mol. Mass.:
369.3713
SMILES:
COc1cc(OC)c2cc([nH]c2c1)C(=O)NN=Cc1cccc(OC)c1O
: