Target
Nuclear receptor coactivator 1
Ligand
BDBM50087289
Substrate
Meas. Tech.
Luminescence-based cell-based high throughput dose response assay for inhibitors of the Steroid Receptor Coactivator 1 (SRC1; NCOA1)
IC50
25587±n/a nM
Citation
 PubChem, PC Luminescence-based cell-based high throughput dose response assay for inhibitors of the Steroid Receptor Coactivator 1 (SRC1; NCOA1) PubChem Bioassay (2012)[AID] 
Target
Name:
Nuclear receptor coactivator 1
Synonyms:
BHLHE74 NCOA1 NCoA-1 Protein Hin-2 Renal carcinoma antigen NY-REN-52 SRC1 nuclear receptor coactivator 1 isoform 1
Type:
PROTEIN
Mol. Mass.:
156749.34
Organism:
Homo sapiens (Human)
Description:
ChEMBL_759690
Residue:
1441
  
Inhibitor
Name:
BDBM50087289
Synonyms:
1-beta-D-Arabinofuranosylcytosine 4-amino-1-beta-D-arabinofuranosylpyrimidin-2(1H)-one CYTARABINE
Type:
Small organic molecule
Emp. Form.:
C9H13N3O5
Mol. Mass.:
243.2166
SMILES:
Nc1ccn([C@@H]2O[C@H](CO)[C@@H](O)[C@@H]2O)c(=O)n1
: