Target
Polyadenylate-binding protein 1
Ligand
BDBM87604
Substrate
Meas. Tech.
Dose-response confirmation of microRNA-mediated mRNA deadenylation inhibitors by fluoresence polarization assay
IC50
>66000±n/a nM
Citation
 PubChem, PC Dose-response confirmation of microRNA-mediated mRNA deadenylation inhibitors by fluoresence polarization assay PubChem Bioassay (2012)[AID] 
Target
Name:
Polyadenylate-binding protein 1
Synonyms:
PAB1 PABP1 PABPC1 poly(A) binding protein, cytoplasmic 1 | polyadenylate-binding protein 1
Type:
Enzyme Catalytic Domain
Mol. Mass.:
70694.26
Organism:
Homo sapiens (Human)
Description:
gi_46367787
Residue:
636
  
Inhibitor
Name:
BDBM87604
Synonyms:
2-(3-Oxo-2,3,5,6-tetrahydro-imidazo[2,1-b]thiazol-2-yl)-N-p-tolyl-acetamide MLS000076386 N-(4-methylphenyl)-2-(3-oxo-5,6-dihydroimidazo[2,1-b][1,3]thiazol-2-yl)acetamide SMR000015003 | cid_651069
Type:
Small organic molecule
Emp. Form.:
C14H15N3O2S
Mol. Mass.:
289.353
SMILES:
Cc1ccc(NC(=O)CC2SC3=NCCN3C2=O)cc1
: