Target
Polyadenylate-binding protein 1
Ligand
BDBM47000
Substrate
Meas. Tech.
Dose-response confirmation of microRNA-mediated mRNA deadenylation inhibitors by fluoresence polarization assay
IC50
>66000±n/a nM
Citation
 PubChem, PC Dose-response confirmation of microRNA-mediated mRNA deadenylation inhibitors by fluoresence polarization assay PubChem Bioassay (2012)[AID] 
Target
Name:
Polyadenylate-binding protein 1
Synonyms:
PAB1 PABP1 PABPC1 poly(A) binding protein, cytoplasmic 1 | polyadenylate-binding protein 1
Type:
Enzyme Catalytic Domain
Mol. Mass.:
70694.26
Organism:
Homo sapiens (Human)
Description:
gi_46367787
Residue:
636
  
Inhibitor
Name:
BDBM47000
Synonyms:
5-butyl-2-[2-(dimethylamino)ethylsulfanyl]-6-hydroxy-1-phenylpyrimidin-4-one 5-butyl-2-[2-(dimethylamino)ethylthio]-6-hydroxy-1-phenyl-4-pyrimidinone MLS000078204 cid_660789
Type:
Small organic molecule
Emp. Form.:
C18H25N3O2S
Mol. Mass.:
347.475
SMILES:
CCCCc1c(O)nc(SCCN(C)C)n(-c2ccccc2)c1=O
: