Target
Polyadenylate-binding protein 1
Ligand
BDBM87638
Substrate
Meas. Tech.
Dose-response confirmation of microRNA-mediated mRNA deadenylation inhibitors by fluoresence polarization assay
IC50
>66000±n/a nM
Citation
 PubChem, PC Dose-response confirmation of microRNA-mediated mRNA deadenylation inhibitors by fluoresence polarization assay PubChem Bioassay (2012)[AID] 
Target
Name:
Polyadenylate-binding protein 1
Synonyms:
PAB1 PABP1 PABPC1 poly(A) binding protein, cytoplasmic 1 | polyadenylate-binding protein 1
Type:
Enzyme Catalytic Domain
Mol. Mass.:
70694.26
Organism:
Homo sapiens (Human)
Description:
gi_46367787
Residue:
636
  
Inhibitor
Name:
BDBM87638
Synonyms:
3-[(6-methyl-4-oxidanylidene-1H-pyrimidin-2-yl)sulfanylmethyl]-1,2,3-benzotriazin-4-one 3-[[(4-keto-6-methyl-1H-pyrimidin-2-yl)thio]methyl]-1,2,3-benzotriazin-4-one MLS000081847 cid_818197
Type:
Small organic molecule
Emp. Form.:
C13H11N5O2S
Mol. Mass.:
301.324
SMILES:
Cc1cc(=O)[nH]c(SCn2nnc3ccccc3c2=O)n1
: