Target
Polyadenylate-binding protein 1
Ligand
BDBM40037
Substrate
Meas. Tech.
Dose-response confirmation of microRNA-mediated mRNA deadenylation inhibitors by fluoresence polarization assay
IC50
53350±n/a nM
Citation
 PubChem, PC Dose-response confirmation of microRNA-mediated mRNA deadenylation inhibitors by fluoresence polarization assay PubChem Bioassay (2012)[AID] 
Target
Name:
Polyadenylate-binding protein 1
Synonyms:
PAB1 PABP1 PABPC1 poly(A) binding protein, cytoplasmic 1 | polyadenylate-binding protein 1
Type:
Enzyme Catalytic Domain
Mol. Mass.:
70694.26
Organism:
Homo sapiens (Human)
Description:
gi_46367787
Residue:
636
  
Inhibitor
Name:
BDBM40037
Synonyms:
(3aS,4R,9bR)-4-(2-pyridinyl)-3a,4,5,9b-tetrahydro-3H-cyclopenta[c]quinoline-8-carboxylic acid (3aS,4R,9bR)-4-pyridin-2-yl-3a,4,5,9b-tetrahydro-3H-cyclopenta[c]quinoline-8-carboxylic acid MLS000085196 cid_1203912
Type:
Small organic molecule
Emp. Form.:
C18H16N2O2
Mol. Mass.:
292.3318
SMILES:
OC(=O)c1ccc2N[C@H]([C@H]3CC=C[C@H]3c2c1)c1ccccn1
: