Target
Polyadenylate-binding protein 1
Ligand
BDBM87697
Substrate
Meas. Tech.
Dose-response confirmation of microRNA-mediated mRNA deadenylation inhibitors by fluoresence polarization assay
IC50
>66000±n/a nM
Citation
 PubChem, PC Dose-response confirmation of microRNA-mediated mRNA deadenylation inhibitors by fluoresence polarization assay PubChem Bioassay (2012)[AID] 
Target
Name:
Polyadenylate-binding protein 1
Synonyms:
PAB1 PABP1 PABPC1 poly(A) binding protein, cytoplasmic 1 | polyadenylate-binding protein 1
Type:
Enzyme Catalytic Domain
Mol. Mass.:
70694.26
Organism:
Homo sapiens (Human)
Description:
gi_46367787
Residue:
636
  
Inhibitor
Name:
BDBM87697
Synonyms:
2,3-dimethoxy-N-(2-thiazolin-2-yl)benzamide N-(4,5-dihydro-1,3-thiazol-2-yl)-2,3-dimethoxy-benzamide N-(4,5-dihydrothiazol-2-yl)-2,3-dimethoxybenzamide cid_1246268
Type:
Small organic molecule
Emp. Form.:
C12H14N2O3S
Mol. Mass.:
266.316
SMILES:
COc1cccc(C(=O)NC2=NCCS2)c1OC
: