Target
Polyadenylate-binding protein 1
Ligand
BDBM87620
Substrate
Meas. Tech.
Dose-response secondary confirmation of microRNA-mediated mRNA deadenylation inhibitors by fluoresence polarization assay using Cy5 labeled peptide
IC50
>66000±n/a nM
Citation
 PubChem, PC Dose-response secondary confirmation of microRNA-mediated mRNA deadenylation inhibitors by fluoresence polarization assay using Cy5 labeled peptide PubChem Bioassay (2012)[AID] 
Target
Name:
Polyadenylate-binding protein 1
Synonyms:
PAB1 PABP1 PABPC1 poly(A) binding protein, cytoplasmic 1 | polyadenylate-binding protein 1
Type:
Enzyme Catalytic Domain
Mol. Mass.:
70694.26
Organism:
Homo sapiens (Human)
Description:
gi_46367787
Residue:
636
  
Inhibitor
Name:
BDBM87620
Synonyms:
7-ethyl-1-(2-hydroxyethylamino)-3-(4-morpholinyl)-6,8-dihydro-5H-2,7-naphthyridine-4-carbonitrile 7-ethyl-1-(2-hydroxyethylamino)-3-morpholino-6,8-dihydro-5H-2,7-naphthyridine-4-carbonitrile SMR000039380 | cid_658426
Type:
Small organic molecule
Emp. Form.:
C17H25N5O2
Mol. Mass.:
331.4127
SMILES:
CCN1CCc2c(C1)c(NCCO)nc(N1CCOCC1)c2C#N
: