Target
Polyadenylate-binding protein 1
Ligand
BDBM46342
Substrate
Meas. Tech.
Dose-response secondary confirmation of microRNA-mediated mRNA deadenylation inhibitors by fluoresence polarization assay using Cy5 labeled peptide
IC50
>66000±n/a nM
Citation
 PubChem, PC Dose-response secondary confirmation of microRNA-mediated mRNA deadenylation inhibitors by fluoresence polarization assay using Cy5 labeled peptide PubChem Bioassay (2012)[AID] 
Target
Name:
Polyadenylate-binding protein 1
Synonyms:
PAB1 PABP1 PABPC1 poly(A) binding protein, cytoplasmic 1 | polyadenylate-binding protein 1
Type:
Enzyme Catalytic Domain
Mol. Mass.:
70694.26
Organism:
Homo sapiens (Human)
Description:
gi_46367787
Residue:
636
  
Inhibitor
Name:
BDBM46342
Synonyms:
3-[[1-(2-methoxy-5-methyl-phenyl)-1,2,3,4-tetrazol-5-yl]sulfanylmethyl]-1,2,3-benzotriazin-4-one 3-[[[1-(2-methoxy-5-methyl-phenyl)tetrazol-5-yl]thio]methyl]-1,2,3-benzotriazin-4-one MLS000053815 cid_2546259
Type:
Small organic molecule
Emp. Form.:
C17H15N7O2S
Mol. Mass.:
381.412
SMILES:
COc1ccc(C)cc1-n1nnnc1SCn1nnc2ccccc2c1=O
: