Target
Polyadenylate-binding protein 1
Ligand
BDBM34422
Substrate
Meas. Tech.
Dose-response secondary confirmation of microRNA-mediated mRNA deadenylation inhibitors by fluoresence polarization assay using Cy5 labeled peptide
IC50
>66000±n/a nM
Citation
 PubChem, PC Dose-response secondary confirmation of microRNA-mediated mRNA deadenylation inhibitors by fluoresence polarization assay using Cy5 labeled peptide PubChem Bioassay (2012)[AID] 
Target
Name:
Polyadenylate-binding protein 1
Synonyms:
PAB1 PABP1 PABPC1 poly(A) binding protein, cytoplasmic 1 | polyadenylate-binding protein 1
Type:
Enzyme Catalytic Domain
Mol. Mass.:
70694.26
Organism:
Homo sapiens (Human)
Description:
gi_46367787
Residue:
636
  
Inhibitor
Name:
BDBM34422
Synonyms:
1-{[6-(2,3-dihydro-1,4-benzodioxin-6-yl)[1,2,4]triazolo[3,4-b][1,3,4]thiadiazol-3-yl]methyl}-1H-1,2,3-benzotriazole 3-(benzotriazol-1-ylmethyl)-6-(2,3-dihydro-1,4-benzodioxin-6-yl)-[1,2,4]triazolo[3,4-b][1,3,4]thiadiazole SMR000081761 | cid_2231443
Type:
Small organic molecule
Emp. Form.:
C18H13N7O2S
Mol. Mass.:
391.407
SMILES:
C(c1nnc2sc(nn12)-c1ccc2OCCOc2c1)n1nnc2ccccc12
: