Target
Melanocortin receptor 4
Ligand
BDBM55532
Substrate
Meas. Tech.
Luminescence-based cell-based high throughput dose response assay for biased ligands (agonists) of the melanocortin 4 receptor (MC4R)
EC50
>89186±n/a nM
Citation
 PubChem, PC Luminescence-based cell-based high throughput dose response assay for biased ligands (agonists) of the melanocortin 4 receptor (MC4R) PubChem Bioassay (2012)[AID] 
Target
Name:
Melanocortin receptor 4
Synonyms:
MC4-R MC4R_HUMAN Melanocortin receptor 4 (MC-4) Melanocortin receptor 4 (MC4R)
Type:
Enzyme
Mol. Mass.:
36949.50
Organism:
Homo sapiens (Human)
Description:
P32245
Residue:
332
  
Inhibitor
Name:
BDBM55532
Synonyms:
MLS000582933 N-(5-bromo-6-methyl-2-pyridinyl)-3-(2-oxo-1-benzopyran-3-yl)benzamide N-(5-bromo-6-methyl-2-pyridyl)-3-(2-ketochromen-3-yl)benzamide SMR000201639 | cid_1258911
Type:
Small organic molecule
Emp. Form.:
C22H15BrN2O3
Mol. Mass.:
435.27
SMILES:
Cc1nc(NC(=O)c2cccc(c2)-c2cc3ccccc3oc2=O)ccc1Br
: