Target
Melanocortin receptor 4
Ligand
BDBM88442
Substrate
Meas. Tech.
Luminescence-based cell-based high throughput dose response assay for biased ligands (agonists) of the melanocortin 4 receptor (MC4R)
EC50
>89200±n/a nM
Citation
 PubChem, PC Luminescence-based cell-based high throughput dose response assay for biased ligands (agonists) of the melanocortin 4 receptor (MC4R) PubChem Bioassay (2012)[AID] 
Target
Name:
Melanocortin receptor 4
Synonyms:
MC4-R MC4R_HUMAN Melanocortin receptor 4 (MC-4) Melanocortin receptor 4 (MC4R)
Type:
Enzyme
Mol. Mass.:
36949.50
Organism:
Homo sapiens (Human)
Description:
P32245
Residue:
332
  
Inhibitor
Name:
BDBM88442
Synonyms:
MLS000573251 N-[(3-benzamidoanilino)-sulfanylidenemethyl]-2-thiophenecarboxamide N-[(3-benzamidophenyl)thiocarbamoyl]thiophene-2-carboxamide cid_1349192
Type:
Small organic molecule
Emp. Form.:
C19H15N3O2S2
Mol. Mass.:
381.471
SMILES:
O=C(NC(=S)Nc1cccc(NC(=O)c2ccccc2)c1)c1cccs1
: