Target
Melanocortin receptor 4
Ligand
BDBM41950
Substrate
Meas. Tech.
Luminescence-based cell-based high throughput dose response assay for biased ligands (agonists) of the melanocortin 4 receptor (MC4R)
EC50
>89245±n/a nM
Citation
 PubChem, PC Luminescence-based cell-based high throughput dose response assay for biased ligands (agonists) of the melanocortin 4 receptor (MC4R) PubChem Bioassay (2012)[AID] 
Target
Name:
Melanocortin receptor 4
Synonyms:
MC4-R MC4R_HUMAN Melanocortin receptor 4 (MC-4) Melanocortin receptor 4 (MC4R)
Type:
Enzyme
Mol. Mass.:
36949.50
Organism:
Homo sapiens (Human)
Description:
P32245
Residue:
332
  
Inhibitor
Name:
BDBM41950
Synonyms:
2,5-Bis-ethylaminomethyl-1,6-bis-(4-propoxy-phenyl)-hexane-1,6-dione MLS000587374 cid_12005598
Type:
Small organic molecule
Emp. Form.:
C30H44N2O4
Mol. Mass.:
496.6814
SMILES:
CCCOc1ccc(cc1)C(=O)C(CCC(CNCC)C(=O)c1ccc(OCCC)cc1)CNCC
: