Target
Melanocortin receptor 4
Ligand
BDBM74865
Substrate
Meas. Tech.
Luminescence-based cell-based high throughput dose response assay for biased ligands (agonists) of the melanocortin 4 receptor (MC4R)
EC50
>89170±n/a nM
Citation
 PubChem, PC Luminescence-based cell-based high throughput dose response assay for biased ligands (agonists) of the melanocortin 4 receptor (MC4R) PubChem Bioassay (2012)[AID] 
Target
Name:
Melanocortin receptor 4
Synonyms:
MC4-R MC4R_HUMAN Melanocortin receptor 4 (MC-4) Melanocortin receptor 4 (MC4R)
Type:
Enzyme
Mol. Mass.:
36949.50
Organism:
Homo sapiens (Human)
Description:
P32245
Residue:
332
  
Inhibitor
Name:
BDBM74865
Synonyms:
(E)-2-cyano-3-[5-(4-fluorophenyl)-2-furanyl]-N-(4-thiophen-2-yl-2-thiazolyl)-2-propenamide (E)-2-cyano-3-[5-(4-fluorophenyl)furan-2-yl]-N-(4-thiophen-2-yl-1,3-thiazol-2-yl)prop-2-enamide SMR000262229 | cid_2328888
Type:
Small organic molecule
Emp. Form.:
C21H12FN3O2S2
Mol. Mass.:
421.467
SMILES:
Fc1ccc(cc1)-c1ccc(\C=C(/C#N)C(=O)Nc2nc(cs2)-c2cccs2)o1
: