Target
Melanocortin receptor 4
Ligand
BDBM51890
Substrate
Meas. Tech.
Luminescence-based cell-based high throughput dose response assay for biased ligands (agonists) of the melanocortin 4 receptor (MC4R)
EC50
>89182±n/a nM
Citation
 PubChem, PC Luminescence-based cell-based high throughput dose response assay for biased ligands (agonists) of the melanocortin 4 receptor (MC4R) PubChem Bioassay (2012)[AID] 
Target
Name:
Melanocortin receptor 4
Synonyms:
MC4-R MC4R_HUMAN Melanocortin receptor 4 (MC-4) Melanocortin receptor 4 (MC4R)
Type:
Enzyme
Mol. Mass.:
36949.50
Organism:
Homo sapiens (Human)
Description:
P32245
Residue:
332
  
Inhibitor
Name:
BDBM51890
Synonyms:
MLS000911514 N-[4-[(4-ethylpiperazin-1-yl)methyl]-3-(trifluoromethyl)phenyl]-3-[[2-(1H-indol-3-yl)-2-oxidanylidene-ethanoyl]amino]-5-methoxy-benzamide N-[4-[(4-ethylpiperazino)methyl]-3-(trifluoromethyl)phenyl]-3-[[2-(1H-indol-3-yl)-2-keto-acetyl]amino]-5-methoxy-benzamide SMR000453564 | cid_16745813
Type:
Small organic molecule
Emp. Form.:
C32H32F3N5O4
Mol. Mass.:
607.6228
SMILES:
CCN1CCN(Cc2ccc(NC(=O)c3cc(NC(=O)C(=O)c4c[nH]c5ccccc45)cc(OC)c3)cc2C(F)(F)F)CC1
: