Target
Melanocortin receptor 4
Ligand
BDBM57063
Substrate
Meas. Tech.
TRFRET-based cell-based high throughput dose response assay for biased ligands (antagonists) of the melanocortin 4 receptor (MC4R)
IC50
>64564±n/a nM
Citation
 PubChem, PC TRFRET-based cell-based high throughput dose response assay for biased ligands (antagonists) of the melanocortin 4 receptor (MC4R) PubChem Bioassay (2012)[AID] 
Target
Name:
Melanocortin receptor 4
Synonyms:
MC4-R MC4R_HUMAN Melanocortin receptor 4 (MC-4) Melanocortin receptor 4 (MC4R)
Type:
Enzyme
Mol. Mass.:
36949.50
Organism:
Homo sapiens (Human)
Description:
P32245
Residue:
332
  
Inhibitor
Name:
BDBM57063
Synonyms:
1-methyl-2,4,6-triphenyl-3-propan-2-yl-4-piperidinol 1-methyl-2,4,6-triphenyl-3-propan-2-ylpiperidin-4-ol MLS000525447 cid_3089037
Type:
Small organic molecule
Emp. Form.:
C27H31NO
Mol. Mass.:
385.5411
SMILES:
CC(C)C1C(N(C)C(CC1(O)c1ccccc1)c1ccccc1)c1ccccc1
: