Target
Melanocortin receptor 4
Ligand
BDBM79568
Substrate
Meas. Tech.
TRFRET-based cell-based high throughput dose response assay for biased ligands (antagonists) of the melanocortin 4 receptor (MC4R)
IC50
12119±n/a nM
Citation
 PubChem, PC TRFRET-based cell-based high throughput dose response assay for biased ligands (antagonists) of the melanocortin 4 receptor (MC4R) PubChem Bioassay (2012)[AID] 
Target
Name:
Melanocortin receptor 4
Synonyms:
MC4-R MC4R_HUMAN Melanocortin receptor 4 (MC-4) Melanocortin receptor 4 (MC4R)
Type:
Enzyme
Mol. Mass.:
36949.50
Organism:
Homo sapiens (Human)
Description:
P32245
Residue:
332
  
Inhibitor
Name:
BDBM79568
Synonyms:
MLS000706381 N,N-dimethyl-4-[2-[(E)-2-nitroethenyl]pyrrol-1-yl]aniline cid_5662106 | dimethyl-[4-[2-[(E)-2-nitrovinyl]pyrrol-1-yl]phenyl]amine
Type:
Small organic molecule
Emp. Form.:
C14H15N3O2
Mol. Mass.:
257.2878
SMILES:
CN(C)c1ccc(cc1)-n1cccc1\C=C\[N+]([O-])=O
: