Target
Melanocortin receptor 4
Ligand
BDBM72610
Substrate
Meas. Tech.
TRFRET-based cell-based high throughput dose response assay for biased ligands (antagonists) of the melanocortin 4 receptor (MC4R)
IC50
>64640±n/a nM
Citation
 PubChem, PC TRFRET-based cell-based high throughput dose response assay for biased ligands (antagonists) of the melanocortin 4 receptor (MC4R) PubChem Bioassay (2012)[AID] 
Target
Name:
Melanocortin receptor 4
Synonyms:
MC4-R MC4R_HUMAN Melanocortin receptor 4 (MC-4) Melanocortin receptor 4 (MC4R)
Type:
Enzyme
Mol. Mass.:
36949.50
Organism:
Homo sapiens (Human)
Description:
P32245
Residue:
332
  
Inhibitor
Name:
BDBM72610
Synonyms:
5-nitro-2-furancarboxylic acid [2-[4-amino-1-methyl-3-(2-methylpropyl)-2,6-dioxo-5-pyrimidinyl]-2-oxoethyl] ester MLS001004611 [2-[4-amino-1-methyl-3-(2-methylpropyl)-2,6-dioxopyrimidin-5-yl]-2-oxoethyl] 5-nitrofuran-2-carboxylate cid_2084008
Type:
Small organic molecule
Emp. Form.:
C16H18N4O8
Mol. Mass.:
394.3361
SMILES:
CC(C)Cn1c(N)c(C(=O)COC(=O)c2ccc(o2)[N+]([O-])=O)c(=O)n(C)c1=O
: