Target
Melanocortin receptor 4
Ligand
BDBM66634
Substrate
Meas. Tech.
TRFRET-based cell-based high throughput dose response assay for biased ligands (antagonists) of the melanocortin 4 receptor (MC4R)
IC50
>64577±n/a nM
Citation
 PubChem, PC TRFRET-based cell-based high throughput dose response assay for biased ligands (antagonists) of the melanocortin 4 receptor (MC4R) PubChem Bioassay (2012)[AID] 
Target
Name:
Melanocortin receptor 4
Synonyms:
MC4-R MC4R_HUMAN Melanocortin receptor 4 (MC-4) Melanocortin receptor 4 (MC4R)
Type:
Enzyme
Mol. Mass.:
36949.50
Organism:
Homo sapiens (Human)
Description:
P32245
Residue:
332
  
Inhibitor
Name:
BDBM66634
Synonyms:
4-amino-7-(3,4-dihydroxy-5-methylol-tetrahydrofuran-2-yl)pyrrolo[2,3-d]pyrimidine-5-carbothioamide 4-amino-7-[3,4-dihydroxy-5-(hydroxymethyl)oxolan-2-yl]pyrrolo[2,3-d]pyrimidine-5-carbothioamide MLS000737251 Thiosangivamycin | cid_3580213
Type:
Small organic molecule
Emp. Form.:
C12H15N5O4S
Mol. Mass.:
325.344
SMILES:
NC(=S)c1cn(C2OC(CO)C(O)C2O)c2ncnc(N)c12
: