Target
Lethal factor
Ligand
BDBM88699
Substrate
Meas. Tech.
High-throughput multiplex microsphere dose response for inhibitors of toxin protease, specifically Lethal Factor protease, compounds from Cherry Pick 02
EC50
>20000±n/a nM
Citation
 PubChem, PC High-throughput multiplex microsphere dose response for inhibitors of toxin protease, specifically Lethal Factor protease, compounds from Cherry Pick 02 PubChem Bioassay (2012)[AID] 
Target
Name:
Lethal factor
Synonyms:
Anthrax Lethal Factor (LF) Antrax lethal toxin lef | lethal factor
Type:
PROTEIN
Mol. Mass.:
93758.56
Organism:
Bacillus anthracis
Description:
ChEMBL_1460338
Residue:
809
  
Inhibitor
Name:
BDBM88699
Synonyms:
4,8-dimethylspiro[3,4-dihydro-1H-quinoline-2,1'-cyclopentane];hydrochloride SMR000427738 | cid_16681803
Type:
Small organic molecule
Emp. Form.:
C15H21N
Mol. Mass.:
215.3339
SMILES:
CC1CC2(CCCC2)Nc2c(C)cccc12
: