Target
Botulinum neurotoxin type A
Ligand
BDBM88703
Substrate
Meas. Tech.
High-throughput multiplex microsphere dose response for inhibitors of toxin protease, specifically Botulinum neurotoxin light chain A protease, compounds from Cherry Pick 02
EC50
>20000±n/a nM
Citation
 PubChem, PC High-throughput multiplex microsphere dose response for inhibitors of toxin protease, specifically Botulinum neurotoxin light chain A protease, compounds from Cherry Pick 02 PubChem Bioassay (2012)[AID] 
Target
Name:
Botulinum neurotoxin type A
Synonyms:
BXA1_CLOBH bna | botA
Type:
PROTEIN
Mol. Mass.:
149421.96
Organism:
Clostridium botulinum (strain Hall / ATCC 3502 / NCTC 13319 / Type A)
Description:
ChEMBL_987932
Residue:
1296
  
Inhibitor
Name:
BDBM88703
Synonyms:
MLS002171722 N-[2-(4-methoxyphenyl)-2-pyrrolidin-1-yl-ethyl]-2-methyl-5-piperidin-1-ylsulfonyl-benzamide N-[2-(4-methoxyphenyl)-2-pyrrolidino-ethyl]-2-methyl-5-piperidinosulfonyl-benzamide cid_16303937
Type:
Small organic molecule
Emp. Form.:
C26H35N3O4S
Mol. Mass.:
485.639
SMILES:
COc1ccc(cc1)C(CNC(=O)c1cc(ccc1C)S(=O)(=O)N1CCCCC1)N1CCCC1
: