Target
Tyrosine-protein phosphatase non-receptor type 11
Ligand
BDBM51096
Substrate
Meas. Tech.
Dose Response selectivity of inhibitors of Striatal-Enriched Phosphatase (STEP) in a SHP2 (PTPN11) Inhibition Assay
IC50
738±n/a nM
Citation
 PubChem, PC Dose Response selectivity of inhibitors of Striatal-Enriched Phosphatase (STEP) in a SHP2 (PTPN11) Inhibition Assay PubChem Bioassay (2012)[AID] 
Target
Name:
Tyrosine-protein phosphatase non-receptor type 11
Synonyms:
PTN11_HUMAN PTP-2C PTPN11 Protein tyrosine phosphatase (PTP) Shp2 Protein-tyrosine phosphatase 2C SHP2 Src homology phosphatase 2 (SHP-2) Tyrosine-protein phosphatase non-receptor type 11 (PTPN11) Tyrosine-protein phosphatase non-receptor type 11 (SHP2)
Type:
Protein phosphatase
Mol. Mass.:
68443.59
Organism:
Homo sapiens (Human)
Description:
Q06124
Residue:
597
  
Inhibitor
Name:
BDBM51096
Synonyms:
2-amino-1-amyl-3-(1,3-benzoxazol-2-yl)-6-methyl-4-nitro-pyrrolo[2,3-d]pyridazin-7-one 2-amino-3-(1,3-benzoxazol-2-yl)-6-methyl-4-nitro-1-pentylpyrrolo[2,3-d]pyridazin-7-one MLS000389744 cid_4963271
Type:
Small organic molecule
Emp. Form.:
C19H20N6O4
Mol. Mass.:
396.3999
SMILES:
CCCCCn1c(N)c(-c2nc3ccccc3o2)c2c(nn(C)c(=O)c12)[N+]([O-])=O
: