Target
Tyrosine-protein phosphatase non-receptor type 11
Ligand
BDBM88759
Substrate
Meas. Tech.
Dose Response selectivity of inhibitors of Striatal-Enriched Phosphatase (STEP) in a SHP2 (PTPN11) Inhibition Assay
IC50
9880±n/a nM
Citation
 PubChem, PC Dose Response selectivity of inhibitors of Striatal-Enriched Phosphatase (STEP) in a SHP2 (PTPN11) Inhibition Assay PubChem Bioassay (2012)[AID] 
Target
Name:
Tyrosine-protein phosphatase non-receptor type 11
Synonyms:
PTN11_HUMAN PTP-2C PTPN11 Protein tyrosine phosphatase (PTP) Shp2 Protein-tyrosine phosphatase 2C SHP2 Src homology phosphatase 2 (SHP-2) Tyrosine-protein phosphatase non-receptor type 11 (PTPN11) Tyrosine-protein phosphatase non-receptor type 11 (SHP2)
Type:
Protein phosphatase
Mol. Mass.:
68443.59
Organism:
Homo sapiens (Human)
Description:
Q06124
Residue:
597
  
Inhibitor
Name:
BDBM88759
Synonyms:
MLS000664771 N-cycloheptyl-2-(cyclohexylamino)-2-sulfanylideneacetamide N-cycloheptyl-2-(cyclohexylamino)-2-thioxoacetamide cid_2974583
Type:
Small organic molecule
Emp. Form.:
C15H26N2OS
Mol. Mass.:
282.445
SMILES:
O=C(NC1CCCCCC1)C(=S)NC1CCCCC1
: