Target
Tyrosine-protein phosphatase non-receptor type 11
Ligand
BDBM51774
Substrate
Meas. Tech.
Dose Response selectivity of inhibitors of Striatal-Enriched Phosphatase (STEP) in a SHP2 (PTPN11) Inhibition Assay
IC50
2000±n/a nM
Citation
 PubChem, PC Dose Response selectivity of inhibitors of Striatal-Enriched Phosphatase (STEP) in a SHP2 (PTPN11) Inhibition Assay PubChem Bioassay (2012)[AID] 
Target
Name:
Tyrosine-protein phosphatase non-receptor type 11
Synonyms:
3.1.3.48 PTP-1D PTP2C Protein Tyrosine Phosphatase PPN11/Shp2 Protein-Tyrosine Phosphatase SHP-2 Protein-tyrosine phosphatase 2C SH-PTP3 SHP2 Src homology phosphatase 2 (SHP-2) Tyrosine-protein phosphatase non-receptor type 11 (SHP-2) | Tyrosine-protein phosphatase non-receptor type 11 (SHP2)
Type:
Protein phosphatase
Mol. Mass.:
68443.59
Organism:
Homo sapiens (Human)
Description:
Q06124
Residue:
593
  
Inhibitor
Name:
BDBM51774
Synonyms:
1'-({[4-(aminosulfonyl)phenyl]amino}carbonothioyl)-1,4'-bipiperidine-4'-carboxamide 4-piperidin-1-yl-1-[(4-sulfamoylphenyl)carbamothioyl]piperidine-4-carboxamide MLS000621463 cid_2193503
Type:
Small organic molecule
Emp. Form.:
C18H27N5O3S2
Mol. Mass.:
425.569
SMILES:
NC(=O)C1(CCN(CC1)C(=S)Nc1ccc(cc1)S(N)(=O)=O)N1CCCCC1
: