Target
Tyrosine-protein phosphatase non-receptor type 11
Ligand
BDBM82815
Substrate
Meas. Tech.
Dose Response selectivity of inhibitors of Striatal-Enriched Phosphatase (STEP) in a SHP2 (PTPN11) Inhibition Assay
IC50
5270±n/a nM
Citation
 PubChem, PC Dose Response selectivity of inhibitors of Striatal-Enriched Phosphatase (STEP) in a SHP2 (PTPN11) Inhibition Assay PubChem Bioassay (2012)[AID] 
Target
Name:
Tyrosine-protein phosphatase non-receptor type 11
Synonyms:
3.1.3.48 PTP-1D PTP2C Protein Tyrosine Phosphatase PPN11/Shp2 Protein-Tyrosine Phosphatase SHP-2 Protein-tyrosine phosphatase 2C SH-PTP3 SHP2 Src homology phosphatase 2 (SHP-2) Tyrosine-protein phosphatase non-receptor type 11 (SHP-2) | Tyrosine-protein phosphatase non-receptor type 11 (SHP2)
Type:
Protein phosphatase
Mol. Mass.:
68443.59
Organism:
Homo sapiens (Human)
Description:
Q06124
Residue:
593
  
Inhibitor
Name:
BDBM82815
Synonyms:
(3-amino-7-methoxy-1-pyrazolo[3,4-b]quinolinyl)-(3-fluorophenyl)methanone (3-amino-7-methoxypyrazolo[3,4-b]quinolin-1-yl)-(3-fluorophenyl)methanone 1-(3-fluorobenzoyl)-7-methoxy-1H-pyrazolo[3,4-b]quinolin-3-amine SMR000309569 | cid_16195356
Type:
Small organic molecule
Emp. Form.:
C18H13FN4O2
Mol. Mass.:
336.3198
SMILES:
COc1ccc2cc3c(N)nn(C(=O)c4cccc(F)c4)c3nc2c1
: