Target
Tyrosine-protein phosphatase non-receptor type 11
Ligand
BDBM88791
Substrate
Meas. Tech.
Dose Response selectivity of inhibitors of Striatal-Enriched Phosphatase (STEP) in a SHP2 (PTPN11) Inhibition Assay
IC50
2130±n/a nM
Citation
 PubChem, PC Dose Response selectivity of inhibitors of Striatal-Enriched Phosphatase (STEP) in a SHP2 (PTPN11) Inhibition Assay PubChem Bioassay (2012)[AID] 
Target
Name:
Tyrosine-protein phosphatase non-receptor type 11
Synonyms:
PTN11_HUMAN PTP-2C PTPN11 Protein tyrosine phosphatase (PTP) Shp2 Protein-tyrosine phosphatase 2C SHP2 Src homology phosphatase 2 (SHP-2) Tyrosine-protein phosphatase non-receptor type 11 (PTPN11) Tyrosine-protein phosphatase non-receptor type 11 (SHP2)
Type:
Protein phosphatase
Mol. Mass.:
68443.59
Organism:
Homo sapiens (Human)
Description:
Q06124
Residue:
597
  
Inhibitor
Name:
BDBM88791
Synonyms:
3-nitro-4-[(2E)-2-(1-thiophen-2-ylethylidene)hydrazinyl]benzenesulfonamide MLS001175204 cid_9652363
Type:
Small organic molecule
Emp. Form.:
C12H12N4O4S2
Mol. Mass.:
340.378
SMILES:
C[C-](\N=[NH+]\c1ccc(cc1[N+]([O-])=O)S(N)(=O)=O)c1cccs1
: