Target
26S proteasome non-ATPase regulatory subunit 14
Ligand
BDBM77761
Substrate
Meas. Tech.
Dose response confirmation of uHTS RPN11 inhibitor hits in a Fluorescence Polarization assay
IC50
8230±1240 nM
Citation
 PubChem, PC Dose response confirmation of uHTS RPN11 inhibitor hits in a Fluorescence Polarization assay PubChem Bioassay (2012)[AID] 
Target
Name:
26S proteasome non-ATPase regulatory subunit 14
Synonyms:
26S Proteasome regulatory subunit Rpn11 (Rpn11) PSDE_HUMAN PSMD14 protein
Type:
Protein
Mol. Mass.:
34576.68
Organism:
Homo sapiens (Human)
Description:
O00487
Residue:
310
  
Inhibitor
Name:
BDBM77761
Synonyms:
MLS000688351 cid_1603092
Type:
Small organic molecule
Emp. Form.:
C15H15NO3
Mol. Mass.:
257.2845
SMILES:
COc1cc2C(=O)C(=O)N3c2c(c1)C(C)=CC3(C)C
: