Target
Prothrombin
Ligand
BDBM60758
Substrate
Meas. Tech.
Dose Response validation of uHTS RPN11 inhibitor hits using a Thrombin Fluorescence Polarization assay
IC50
75300±18000 nM
Citation
 PubChem, PC Dose Response validation of uHTS RPN11 inhibitor hits using a Thrombin Fluorescence Polarization assay PubChem Bioassay (2012)[AID] 
Target
Name:
Prothrombin
Synonyms:
Activation peptide fragment 1 Coagulation factor II Prothrombin Thrombin Thrombin light chain
Type:
Enzyme
Mol. Mass.:
70502.73
Organism:
Bos taurus (Bovine)
Description:
P00735
Residue:
625
  
Inhibitor
Name:
BDBM60758
Synonyms:
2-[(5Z)-5-[(E)-3-(2-furanyl)prop-2-enylidene]-4-oxo-2-sulfanylidene-3-thiazolidinyl]-3-phenylpropanoic acid 2-[(5Z)-5-[(E)-3-(furan-2-yl)prop-2-enylidene]-4-oxidanylidene-2-sulfanylidene-1,3-thiazolidin-3-yl]-3-phenyl-propanoic acid 2-{5-[(E)-3-Furan-2-yl-prop-2-en-(Z)-ylidene]-4-oxo-2-thioxo-thiazolidin-3-yl}-3-phenyl-propionic acid SMR000415562 | cid_6387158
Type:
Small organic molecule
Emp. Form.:
C19H15NO4S2
Mol. Mass.:
385.457
SMILES:
OC(=O)C(Cc1ccccc1)N1C(=S)S\C(=C/C=C/c2ccco2)C1=O
: