Target
Tyrosine-protein phosphatase non-receptor type 5
Ligand
BDBM88755
Substrate
Meas. Tech.
Dose response confirmation of uHTS small molecule inhibitors of Striatal-Enriched Phosphatase via a fluorescence intensity assay
IC50
27800±n/a nM
Citation
 PubChem, PC Dose response confirmation of uHTS small molecule inhibitors of Striatal-Enriched Phosphatase via a fluorescence intensity assay PubChem Bioassay (2012)[AID] 
Target
Name:
Tyrosine-protein phosphatase non-receptor type 5
Synonyms:
PTN5_HUMAN Tyrosine-protein phosphatase non-receptor type 5 | Tyrosine-protein phosphatase non-receptor type 5 isoform a
Type:
Enzyme Catalytic Domain
Mol. Mass.:
63510.68
Organism:
Homo sapiens (Human)
Description:
gi_90652859
Residue:
565
  
Inhibitor
Name:
BDBM88755
Synonyms:
4-methyl-N-(4-sulfamoylphenyl)-1-piperazinecarbothioamide MLS000676519 SMR000299073 | cid_805196
Type:
Small organic molecule
Emp. Form.:
C12H18N4O2S2
Mol. Mass.:
314.427
SMILES:
CN1CCN(CC1)C(=S)Nc1ccc(cc1)S(N)(=O)=O
: