Target
Tyrosine-protein phosphatase non-receptor type 5
Ligand
BDBM82815
Substrate
Meas. Tech.
Dose response confirmation of uHTS small molecule inhibitors of Striatal-Enriched Phosphatase via a fluorescence intensity assay
IC50
16900±n/a nM
Citation
 PubChem, PC Dose response confirmation of uHTS small molecule inhibitors of Striatal-Enriched Phosphatase via a fluorescence intensity assay PubChem Bioassay (2012)[AID] 
Target
Name:
Tyrosine-protein phosphatase non-receptor type 5
Synonyms:
PTN5_HUMAN Tyrosine-protein phosphatase non-receptor type 5 | Tyrosine-protein phosphatase non-receptor type 5 isoform a
Type:
Enzyme Catalytic Domain
Mol. Mass.:
63510.68
Organism:
Homo sapiens (Human)
Description:
gi_90652859
Residue:
565
  
Inhibitor
Name:
BDBM82815
Synonyms:
(3-amino-7-methoxy-1-pyrazolo[3,4-b]quinolinyl)-(3-fluorophenyl)methanone (3-amino-7-methoxypyrazolo[3,4-b]quinolin-1-yl)-(3-fluorophenyl)methanone 1-(3-fluorobenzoyl)-7-methoxy-1H-pyrazolo[3,4-b]quinolin-3-amine SMR000309569 | cid_16195356
Type:
Small organic molecule
Emp. Form.:
C18H13FN4O2
Mol. Mass.:
336.3198
SMILES:
COc1ccc2cc3c(N)nn(C(=O)c4cccc(F)c4)c3nc2c1
: